{"text_format":"3","workbook":"xlsx","n_sheets":5,"sheets":["8537","Customer confirmation","Currency-codes","IBAN","Codes&Tables"],"not_rendered":{"images":2,"defined_names":19},"read":"whole","date_system":"1900"}

{"sheet":"8537","index":0,"n_rows":234,"n_cols":17,"rows_kept":234,"merged":[[0,13,3,15],[5,18,8,25],[6,1,6,2],[6,4,6,7],[6,9,23,16],[8,1,8,3],[9,1,9,7],[9,18,11,25],[11,1,11,7],[12,1,12,7],[12,19,13,25],[13,1,13,7],[14,1,14,7],[14,18,20,25],[18,1,18,7],[19,1,19,7],[20,1,20,7],[21,1,21,7],[25,1,25,7],[26,1,26,7],[27,1,27,7],[28,0,29,0],[28,1,28,7],[30,1,30,7],[32,1,32,7],[34,1,34,4],[34,6,34,7],[36,1,36,7],[37,1,37,7],[38,1,38,7],[39,0,40,0],[39,1,39,7],[43,9,43,11],[43,12,43,16],[45,14,45,16],[51,9,51,10],[51,12,51,16],[55,4,55,6],[55,9,55,16],[62,1,62,7],[63,1,63,7],[63,14,63,16],[64,1,64,7],[65,1,65,7],[65,9,65,16],[66,9,68,16],[68,0,71,0],[68,1,68,7],[69,1,69,7],[69,9,70,16],[70,1,70,7],[71,1,71,7]]}
[null,"International Transfer Order",{"$nulls":7},"To",{"$nulls":3},"*BC63+*",null,null,"BC63+"]
[]
[]
[null,"Please transfer as specified below"]
[]
[null,"Currency",{"$nulls":3},"Amount (in figures)"]
[{"$nulls":9},"This form is to be used for all international transfers\nin Euro and foreign currencies, which do not meet the criteria for a SEPA payment (see below).\nPlease indicate the required data concerning the beneficiary and\nthe beneficiary's bank account and bank in terms of IBAN (international\nbank account number) and BIC (Bank identifier code).\n\nIf it is required to purchase a currency, the order will be executed only after the currency transaction has been completed.\n\n\nFor all conditions in respect of international transfers please refer to\nthe price list displayed in our branches - available at  https://www.bankaustria.at/files/preise_auslandszahlungsverkehr_en_bis_09102023.pdf and https://www.bankaustria.at/files/preise_auslandszahlungsverkehr_en.pdf"]
["ACCOUNT",{"$f":"IF(ISNA(MATCH(B7,$A$79:$A$234,0)),\"currency invalid!!!\",\"account-number (without '-','/')\")","v":"currency invalid!!!"},{"$nulls":4},"Date (DD.MM.YYYY)"]
["NO.",{"$nulls":5},{"$f":"TODAY()","v":"2026-01-19"}]
["HOLDER"]
[null,"ordering customer max 4x35 spaces"]
["NAME"]
["NAME"]
["STREET"]
[]
[]
[]
[null,"Purpose of payment max. 4x35 spaces"]
[]
[]
[]
[]
[]
[]
[null,"Beneficiary max 4x35 spaces",{"$nulls":7},"Criteria for SEPA payments:"]
["NAME"]
["NAME",{"$nulls":8},"- Transfer currency: Euro"]
["STREET",{"$nulls":8},"- The beneficiary's bank account is stated in terms of a valid IBAN"]
[{"$nulls":9},"- Cross-border payment between the payer's and beneficiary's banks "]
[null,"Beneficiary's Bank ",{"$nulls":7},"  within the EU member states and the EEA member states"]
["IBAN **)",{"$nulls":8},"  Iceland, Norway and Liechtenstein or a SEPA contry outside EEA"]
["or",{"$f":"IF(B31=\"\",\"\",IBAN!C21)","v":""},{"$nulls":7},"  (e.g. United Kingdom or Switzerland), detailed list:"]
["ACC.NO.",{"$nulls":8},"  https://www.bankaustria.at/files/sepa-kundeninfo-en.pdf"]
[null,"BIC Code/SWIFT Addr.",{"$nulls":3},"Routing-Type / Routing-Code",{"$nulls":3},"- Shared fees: Bank charges in Austria debit to payer, "]
[{"$nulls":9},"  outside Austria debit to beneficiary"]
[null,"Bank max 4x35 spaces",{"$nulls":7},"- No special instructions under:"]
["NAME",{"$nulls":8},"   “Mode of transfer”"]
["NAME",{"$nulls":8},"   “Special statements by payer”"]
["STREET"]
[]
[null,"bank charges (for transfers outside EEA) *)"]
[null,"in Austria: debit to",null,null," payer",null,null," beneficiary",null,"For internal use by bank:"]
[]
[null,"outside Austria",null,null," payer",null,null," beneficiary",null,"FBAWI"]
[null,{"$f":"IF(AND(D42<>\"\",G42<>\"\"),\"charges option not allowed\",\"\")&IF(AND(D44<>\"\",G44<>\"\"),\"charges option not allowed\",\"\")&IF(AND(G42<>\"\",D44<>\"\"),\"charges option not allowed\",\"\")","v":""}]
[null,"*) transfers within EEA area or IF NOT SPECIFIED:",{"$nulls":7},"Country of Banking Connection"]
[null,"     charges in Austria debit to payer,"]
[null,"     charges outside Austria debit to beneficiary",{"$nulls":8},"Transfer-order issued by branch"]
[null,"MODE OF TRANSFER:",{"$nulls":7},"for cheque remittance only"]
[null,"x"," Standard ",null," Cheque ",null,null," URGENT",null,null," Registered",null,null," Express"]
[{"$nulls":7},"Currency acc.",null,"Currency for charges",null,null,"Account for charges (if different from standard)"]
[{"$nulls":4}," EUR-account"]
[]
[null,null,"T=FX/forward contract",{"$nulls":6},{"$f":"IF(J52<>\"\",IF(ISNA(MATCH(J52,$A$79:$A$234,0)),\"incorrect Currency!!!\",\"\"),\"\")","v":""},null,null,{"$f":"IF(AND(J52<>\"\",M52=\"\"),\"please insert a charges account no.\",\"\")","v":""}]
[]
[null,null,"K=FX/spot contract",{"$nulls":4}," Number",null,"geprüft / Stempel (bankinternal only)"]
[null,null,"V=Loan"]
[null,{"$f":"IF(AND($B$50<>\"\",$G$50<>\"\"),\"mode of transfer: only standard or urgent allowed\",\"\")","v":""}]
[null,{"$f":"IF(AND($B$50<>\"\",$D$50<>\"\"),\"mode of transfer: only standard or cheque allowed\",\"\")","v":""}]
[null,{"$f":"IF(AND(D50<>\"\",G50<>\"\"),\"mode of transfer cheque: additional only 'express' instead *urgent' is allowed \",\"\")","v":""}]
{"$rows_left_out":175}
{"sheet":"Customer confirmation","index":1,"n_rows":74,"n_cols":15,"rows_kept":74,"merged":[[2,1,2,5],[3,14,5,16],[6,1,6,2],[6,4,6,7],[9,1,9,7],[12,11,13,15],[14,0,15,0],[18,9,28,16],[28,0,29,0],[34,1,34,4],[34,6,34,7],[39,0,40,0],[55,4,55,6],[59,13,59,15],[68,0,71,0],[69,9,70,16]]}
[null,"International Transfer Order",{"$nulls":7},"To"]
[]
[]
[null,"Please transfer as specified below",{"$nulls":12},"copy for ordering customer"]
[]
[null,"Currency",{"$nulls":3},"Amount (in figures)"]
[null,{"$f":"'8537'!B7:C7","v":0},null,null,{"$f":"'8537'!E7:H7","v":{"v":0,"d":"0.00"}}]
["ACCOUNT",{"$nulls":5},"Date (DD,MM,YYYY)"]
["NO.",{"$f":"'8537'!B9","v":0},{"$nulls":4},{"$f":"'8537'!G9","v":"2026-01-19"}]
["HOLDER",{"$f":"'8537'!B10","v":0}]
[null,"ordering customer max 4x35 spaces"]
["NAME",{"$f":"'8537'!B12","v":0}]
["NAME",{"$f":"'8537'!B13","v":0},{"$nulls":9},"assumption confirmation"]
["STREET",{"$f":"'8537'!B14","v":0}]
[null,{"$f":"'8537'!B15","v":0}]
[{"$nulls":11},"is not considered as"]
[{"$nulls":11},"advice of deal"]
[null,"Purpose of payment max. 4x35 spaces"]
[null,{"$f":"'8537'!B19","v":0},{"$nulls":7},"If it is required to purchase a currency, the order will be executed only  after the currency transaction has been completed.\n"]
[null,{"$f":"'8537'!B20","v":0}]
[null,{"$f":"'8537'!B21","v":0}]
[null,{"$f":"'8537'!B22","v":0}]
[]
[]
[null,"Beneficiary max 4x35 spaces"]
["NAME",{"$f":"'8537'!B26","v":0}]
["NAME",{"$f":"'8537'!B27","v":0}]
["STREET",{"$f":"'8537'!B28","v":0}]
[null,{"$f":"'8537'!B29","v":0}]
[null,"Beneficiary's Bank"]
["IBAN **)",{"$f":"'8537'!B31","v":0}]
["or"]
["ACC.NO.",{"$f":"'8537'!B33","v":0}]
[null,"BIC Code/SWIFT Addr.",{"$nulls":3},"Routing-Type / Routing Code"]
[null,{"$f":"'8537'!B35","v":0},{"$nulls":3},{"$f":"'8537'!F35","v":0},{"$f":"'8537'!G35","v":0}]
[null,"Bank max 4x35 spaces "]
["NAME",{"$f":"'8537'!B37","v":0}]
["NAME",{"$f":"'8537'!B38","v":0}]
["STREET",{"$f":"'8537'!B39","v":0}]
[null,{"$f":"'8537'!B40","v":0}]
[null,"bank charges (for transfers outside EEA) *)"]
[null,"in Austria: debit to",null,null," payer",null,null," beneficiary"]
[]
[null,"outside Austria",null,null," payer",null,null," beneficiary"]
[null,{"$f":"IF(AND(D42<>\"\",G42<>\"\"),\"charges option not allowed\",\"\")&IF(AND(D44<>\"\",G44<>\"\"),\"charges option not allowed\",\"\")&IF(AND(G42<>\"\",D44<>\"\"),\"charges option not allowed\",\"\")","v":""}]
[null,"*) transfers within EEA area or IF NOT SPECIFIED:",{"$nulls":7},"Country of Banking Connection",{"$nulls":4},{"$f":"'8537'!O46","v":0}]
[null,"charges in Austria debit to payer,"]
[null,"charges outside Austria debit to beneficiary",{"$nulls":7},{"$f":"'8537'!J48","v":0},"Transfer-order issued by branch"]
[null,"MODE OF TRANSFER:",{"$nulls":7},"for cheque remittance only"]
[null,{"$f":"'8537'!B50","v":"x"}," Standard ",{"$f":"'8537'!D50","v":0}," Cheque ",null,{"$f":"'8537'!G50","v":0}," URGENT",null,{"$f":"'8537'!J50","v":0}," Registered",null,{"$f":"'8537'!M50","v":0}," Express"]
[{"$nulls":7},"Currency acc.",null,"Currency for charges",null,null,"Account for charges (if different from standard)"]
[null,{"$f":"'8537'!B52","v":0},null,{"$f":"'8537'!D52","v":0}," EUR-account",null,null,{"$f":"'8537'!H52","v":0},null,{"$f":"'8537'!J52","v":0},null,null,{"$f":"'8537'!M52","v":0}]
[]
[null,null,"T= FX/forward contract"]
[]
[null,{"$f":"'8537'!B56","v":0},"K=FX/spot contract",null,{"$f":"'8537'!E56","v":0},null,null," Number"]
[null,null,"V=Loan"]
[]
[]
[]
{"$rows_left_out":15}
{"sheet":"Currency-codes","index":2,"n_rows":159,"n_cols":2,"rows_kept":159}
["ISO-Code","Currency"]
["AED","Verein.-Arabische-Emirate-Dirham"]
["AFA","Afghani"]
["ALL","Albanischer Lek                 "]
["AMD","Armenien-Dram                   "]
["ANG","Niederländischer Antillen Gulden"]
["AOA","Kwanza                          "]
["AON","Angola-Kwanza neu               "]
["AOR","Angola-Kwanza Rejusted          "]
["ARS","Argentinischer Peso             "]
["AUD","Australischer Dollar            "]
["AWG","Aruba-Gulden                    "]
["AZM","Aserbeidschan-Manat             "]
["BAM","Mark Convertible                "]
["BBD","Barbados-Dollar                 "]
["BDT","Bangladesch-Taka                "]
["BHD","Bahrain-Dinar                   "]
["BIF","Burundi-Franc                   "]
["BMD","Bermuda-Dollar                  "]
["BND","Brunei-Dollar                   "]
["BOB","Bolivien-Boliviano              "]
["BRL","Brasilien-Real                  "]
["BSD","Bahama-Dollar                   "]
["BTN","Bhutan-Ngultrum                 "]
["BWP","Botswana-Pula                   "]
["BYR","Belarussian Ruble               "]
["BZD","Belize-Dollar                   "]
["CAD","Kanadischer Dollar              "]
["CDF","Franc congolais                 "]
["CHF","Schweizer Franken               "]
["CLP","Chilenischer Peso               "]
["CNY","China-Yuan Renminbi             "]
["COP","Kolumbianischer Peso            "]
["CRC","Costa-Rica-Colon                "]
["CUP","Kubanischer Peso                "]
["CVE","Kap-Verde-Escudo                "]
["CZK","Tschechische Krone              "]
["DJF","Dschibuti-Franc                 "]
["DKK","Dänische Krone                  "]
["DOP","Dominikanischer Peso            "]
["DZD","Algerischer Dinar               "]
["ECS","Ecuador-Sucre                   "]
["EGP","Ägyptisches Pfund               "]
["ERN","Eritrea-Nakfa                   "]
["ETB","Äthiopien-Birr                  "]
["EUR","Euro                            "]
["FJD","Fidschi-Dollar                  "]
["FKP","Falkland-Pfund                  "]
["GBP","Pfund Sterling                  "]
["GEL","Georgien-Lari                   "]
["GHS","Ghana-Cedi                      "]
["GIP","Gibraltar Pfund                 "]
["GMD","Gambia-Dalasi                   "]
["GNF","Guinea-Franc                    "]
["GTQ","Guatemala-Quetzal               "]
["GYD","Guyana-Dollar                   "]
["HKD","Hongkong-Dollar                 "]
["HNL","Honduras-Lempira                "]
["HRK","Kroatien-Kuna                   "]
["HTG","Haiti-Gourde                    "]
{"$rows_left_out":100}
{"sheet":"IBAN","index":3,"n_rows":35,"n_cols":29,"rows_kept":35,"hidden":true,"merged":[[2,1,2,11],[4,2,4,3],[5,2,5,6],[12,2,12,10],[12,13,12,14],[14,2,14,10],[15,2,15,10],[16,2,16,10],[17,2,17,10],[23,1,23,17],[25,2,25,10],[26,2,26,5],[26,7,26,11],[27,2,27,10],[28,2,28,6],[28,7,28,11],[30,13,30,14]]}
[{"$nulls":18},"us9053940502757552705012"]
[]
[null,"Berechnung der IBAN für Österreich (5 Stellen BLZ, 11 Stellen Kontonummer)",{"$nulls":16},"DE89370400440532013000"]
[]
[null,"Bankleitzahl (5-stellig)",20151,{"$nulls":8},{"$f":"IF(FormalfehlerBLZ, \"Österreichische BLZ sind 5 Stellen lang\",\"\")","v":""},{"$nulls":3},{"$f":"IF(LEN(U15)>23,\"RICHTIG\",FALSE)","v":{"$error":"#VALUE!"}},{"$nulls":3},"IBAN - Ziffernfolge",{"$f":"CONCATENATE(TEXT('Codes&Tables'!C59,\"00000\"),TEXT('Codes&Tables'!D59,\"00000000000\"),\"102900\")","v":"2015110080090000102900"},{"$nulls":6},{"$f":"IF(LEN('Codes&Tables'!C59) <> 5, TRUE(), FALSE())","v":false}]
[null,"Kontonummer (max. 11-stellig)",10080090000,{"$nulls":8},{"$f":"IF(FormalfehlerKTONR, \"Österreichische Kontonummern sind maximal 11 Stellen lang\",\"\")","v":""},{"$nulls":15},{"$f":"IF(KTONR_AT = \"\",TRUE(),IF(LEN('Codes&Tables'!D59) > 11, TRUE(), FALSE()))","v":false}]
[{"$nulls":19},"Berechnung Teil1",{"$f":"MOD(VALUE(LEFT(U5,9)),97)","v":7}]
[{"$nulls":19},"Berechnung Teil2",{"$f":"MOD(U7*10000000+VALUE(MID(U5,10,7)),97)","v":31}]
[null,"IBAN",{"$f":"IF(OR(FormalfehlerBLZ,FormalfehlerKTONR),\"IBAN kann wegen fehlerhafter BLZ oder KTONR nicht errechnet werden\",CONCATENATE(\"AT\",TEXT(U10,\"00 \"),TEXT('Codes&Tables'!C59,\"0000 0\"),TEXT('Codes&Tables'!D59,\"000 0000 0000\")))","v":"AT54 2015 1100 8009 0000"},{"$nulls":16},"Berechnung Teil3",{"$f":"MOD(U8*1000000+VALUE(MID(U5,17,6)),97)","v":44}]
[{"$nulls":19},"Prüfziffer",{"$f":"98-U9","v":54}]
[]
[{"$nulls":19},"IBAN seems to be correct"]
[null,null,"Prüfung der IBAN ",{"$nulls":10},"IBAN-Stellenanzahl",{"$nulls":5},"IBAN is incorrect"]
[null,null,{"$f":"MID(C15,1,4)","v":"0"},{"$f":"MID(IBAN,5,4)","v":""},{"$f":"MID(IBAN,9,4)","v":""},{"$f":"MID(IBAN,13,4)","v":""},{"$f":"MID(IBAN,17,4)","v":""},{"$f":"MID(IBAN,21,4)","v":""},{"$f":"MID(IBAN,25,4)","v":""},{"$f":"MID(IBAN,29,4)","v":""},{"$f":"MID(IBAN,33,4)","v":""},null,null,"RICHTIG","lt. Eingabe",{"$nulls":13},"Stellen-Anzahl"]
[null,"IBAN:",{"$f":"'8537'!B31","v":0},{"$nulls":10},{"$f":"VLOOKUP((LEFT(C15,2)),'Codes&Tables'!IBAN_Länge,2,TRUE)","v":{"$error":"#N/A"}},{"$f":"LEN(IBAN)","v":1},{"$nulls":4},"Ziffernfolge IBAN",{"$f":"'Codes&Tables'!E59","v":{"$error":"#VALUE!"}},{"$nulls":6},{"$f":"IF(LEN(SUBSTITUTE('Codes&Tables'!E59,\" \",\"\"))>34,TRUE(),FALSE())","v":{"$error":"#VALUE!"}},{"$f":"LEN(U15)","v":{"$error":"#VALUE!"}}]
[null,"Ergebnis:",{"$f":"IF(Prüfziffer_b = 1, T12, T13)","v":{"$error":"#VALUE!"}}]
[null,null,{"$f":"IF(N15<>O15,\"IBAN-Länge oder LAND ist FALSCH!\",\"IBAN-Länge = O.K. \")","v":{"$error":"#N/A"}},{"$nulls":16},"Berechnung Teil1",{"$f":"MOD(VALUE(LEFT(U15,9)),97)","v":{"$error":"#VALUE!"}},"Stelle 1-9",{"$f":"MOD(221021290,97)","v":0}]
[null,null,{"$f":"+O15-N15","v":{"$error":"#N/A"}},{"$nulls":16},"Berechnung Teil2",{"$f":"MOD(U17*10000000+VALUE(MID(U15,10,7)),97)","v":{"$error":"#VALUE!"}},"Stelle 10-16",{"$f":"MOD(1100001,97)","v":21}]
[{"$nulls":19},"Berechnung Teil3",{"$f":"IF(LEN($U$15)>=23,MOD(U18*10000000+VALUE(MID($U$15,17,7)),97),MOD(U18*10^(LEN($U$15)-16)+VALUE(MID($U$15,17,LEN($U$15)-16)),97))","v":{"$error":"#VALUE!"}},"Stelle 17-23",{"$f":"MOD(212345222,97)","v":0},"O.K.(AD,AT,BE,CH,DK,EE,FI,LT,LU,NO,SI)"]
[{"$nulls":19},"Berechnung Teil4",{"$f":"IF(LEN($U$15)<24,FALSE,IF(LEN($U$15)>=30,MOD(U19*10000000+VALUE(MID($U$15,24,7)),97),MOD(U19*10^(LEN($U$15)-23)+VALUE(MID($U$15,24,LEN($U$15)-23)),97)))","v":{"$error":"#VALUE!"}},"Stelle 24-30",{"$f":"MOD(9211210,97)","v":90},"O.K.(CY,CZ,DE,ES,FR,GB,GI,GR,HU,IE,IS,IT,LI,LV,NL,PL,PT,SE,SK,TR)"]
[null,null,{"$f":"IF(ISERROR(C16),T13,C16)","v":"IBAN is incorrect"},{"$nulls":16},"Berechnung Teil5",{"$f":"IF(LEN($U$15)<31,FALSE,IF(LEN($U$15)>=37,MOD(U20*10000000+VALUE(MID($U$15,31,7)),97),MOD(U20*10^(LEN($U$15)-30)+VALUE(MID($U$15,31,LEN($U$15)-30)),97)))","v":{"$error":"#VALUE!"}},"Stelle 31-37",{"$f":"MOD(902829001,97)","v":46},"O.K.(RO)"]
[{"$nulls":19},"Berechnung Teil6",{"$f":"IF(LEN($U$15)<38,FALSE,IF(LEN($U$15)>=44,MOD(U21*10000000+VALUE(MID($U$15,38,7)),97),MOD(U21*10^(LEN($U$15)-37)+VALUE(MID($U$15,38,LEN($U$15)-37)),97)))","v":{"$error":"#VALUE!"}},"Stelle 38-44",{"$f":"MOD(462822298,97)","v":87}]
[{"$nulls":19},"Berechnung Teil7",{"$f":"IF(LEN($U$15)>44,MOD(U22*10^(LEN($U$15)-44)+VALUE(MID($U$15,45,LEN($U$15)-44)),97))","v":{"$error":"#VALUE!"}},"Stelle 45-51",{"$f":"MOD(870000004,97)","v":20},"O.K.(MT)"]
[null,"Berechnung der IBAN international (die selbst errechnete IBAN darf nicht für Zahlungen verwendet werden! -> FEHLERQUELLE!)",{"$nulls":17},"Prüfziffer",{"$f":"IF(U20=FALSE,U19,0)+IF(U21=FALSE,U20,0)+IF(U22=FALSE,U21,0+IF(U23=FALSE,U22,0)+IF(U23<>FALSE,U23))","v":{"$error":"#VALUE!"}}]
[{"$nulls":12},"Differnz Stellenanzahl",{"$nulls":15},"Stellen-Anzahl"]
[null,"",{"$f":"VLOOKUP(IBAN_Länge,[0]!Länge_BLZ,4,TRUE)","v":{"v":5,"d":"(5 Stellen - Bankleitzahl (lt. Länder-Tabelle))"}},{"$nulls":9},"\"lt.Tabelle\" zu \"eingegeben\"",{"$nulls":6},"IBAN - Ziffernfolge",{"$f":"CONCATENATE(TEXT('Codes&Tables'!F59,REPT(\"0\",C26)),'Codes&Tables'!G59,'Codes&Tables'!H59,\"00\")","v":"0006100519786457841326292700"},{"$nulls":6},{"$f":"IF(LEN(SUBSTITUTE('Codes&Tables'!E69,\" \",\"\"))>34,TRUE(),FALSE())","v":false},{"$f":"LEN(U26)","v":28}]
[null,"Bankleitzahl (ohne Sonderzeichen): ","00061",{"$nulls":4},{"$f":"LEN(BLZ_INT)","v":{"v":5,"d":"5 Stellen Bankleitzahl eingegeben!"}},{"$nulls":4},{"$f":"+H27-C26","v":{"v":0,"d":"0 Stelle(n) Differenz"}}]
[null,"",{"$f":"VLOOKUP(IBAN_Länge,'Codes&Tables'!A101:H136,6,TRUE)","v":{"v":12,"d":"(12 Stellen - Bankleitzahl (lt. Länder-Tabelle))"}},{"$nulls":16},"Berechnung Teil1",{"$f":"MOD(VALUE(LEFT(U26,9)),97)","v":18},"Stelle 1-9"]
[null,"Kontonummer (ohne Sonderzeichen): ","00519786457841326",{"$nulls":4},{"$f":"LEN(KTONR_INT)","v":{"v":17,"d":"17 Stellen Kontonummer eingegeben!"}},{"$nulls":4},{"$f":"+H29-C28","v":{"v":5,"d":"5 Stelle(n) Differenz"}},{"$nulls":6},"Berechnung Teil2",{"$f":"MOD(U28*10000000+VALUE(MID(U26,10,7)),97)","v":40},"Stelle 10-16"]
[null," Landes-Code: ","TR",null,null,"zuerst eingeben!",{"$nulls":13},"Berechnung Teil3",{"$f":"IF(LEN(U26)>=23,MOD(U29*10000000+VALUE(MID(U26,17,7)),97),MOD(U29*10^(LEN(U26)-16)+VALUE(MID(U26,17,LEN(U26)-16)),97))","v":0},"Stelle 17-23",null,"O.K.(AD,AT,BE,CH,DK,EE,FI,LT,LU,NO,SI)"]
[{"$nulls":13},"IBAN-Stellenanzahl",{"$nulls":5},"Berechnung Teil4",{"$f":"IF(LEN($U$26)<24,FALSE,IF(LEN($U$26)>=30,MOD(U30*10000000+VALUE(MID($U$26,24,7)),97),MOD(U30*10^(LEN($U$26)-23)+VALUE(MID($U$26,24,LEN($U$26)-23)),97)))","v":65},"Stelle 24-30",null,"O.K.(CY,CZ,DE,ES,FR,GB,GI,GR,HU,IE,IS,IT,LI,LV,NL,PL,PT,SE,SK,TR)"]
[{"$nulls":13},"IBAN-Länge","lt. Eingabe",{"$nulls":4},"Berechnung Teil5",{"$f":"IF(LEN($U$26)<31,FALSE,IF(LEN($U$26)>=37,MOD(U31*10000000+VALUE(MID($U$26,31,7)),97),MOD(U31*10^(LEN($U$26)-30)+VALUE(MID($U$26,31,LEN($U$26)-30)),97)))","v":false},"Stelle 31-37",null,"O.K.(RO)"]
[null,"\"errechnete\" IBAN lautet:",{"$f":"CONCATENATE(UPPER(C30),TEXT(U35,\"00\"),TEXT(C27,CONCATENATE(REPT(\"0\",C26))),TEXT(C29,REPT(\"0\",C28)))","v":"TR3300061519786457841326"},{"$nulls":10},{"$f":"VLOOKUP((LEFT($C$33,2)),[0]!IBAN_Länge2,2,TRUE)","v":21},{"$f":"LEN(C33)","v":24},{"$nulls":4},"Berechnung Teil6",{"$f":"IF(LEN($U$26)<38,FALSE,IF(LEN($U$26)>=44,MOD(U32*10000000+VALUE(MID($U$26,38,7)),97),MOD(U32*10^(LEN($U$26)-37)+VALUE(MID($U$26,38,LEN($U$26)-37)),97)))","v":false},"Stelle 38-44"]
[{"$nulls":11},{"$f":"IF(N33<>O33,\"IBAN-Länge ist FALSCH!\",\"IBAN-Länge = O.K. \")","v":"IBAN-Länge ist FALSCH!"},{"$nulls":7},"Berechnung Teil7",{"$f":"IF(LEN($U$26)>44,MOD(U33*10^(LEN($U$26)-44)+VALUE(MID($U$26,45,LEN($U$26)-44)),97))","v":false},"Stelle 45-51",null,"O.K.(MT)"]
[{"$nulls":19},"Prüfziffer",{"$f":"IF(U31=FALSE,98-U30,0)+IF(U32=FALSE,IF(U31<>FALSE,98-U31,0),0)+IF(U34=FALSE,IF(U33<>FALSE,98-U33,0),0)+IF(U34<>FALSE,98-U34,0)","v":33}]

{"sheet":"Codes&Tables","index":4,"n_rows":156,"n_cols":10,"rows_kept":156,"hidden":true}
[null,null,"BLZ Österreich","KTONR Österreich","IBAN ","c) BLZ","c) KTONR","c) LAND"]
["A",10,{"$f":"SUBSTITUTE(BLZ_AT,$A2,$B2)","v":"20151"},{"$f":"SUBSTITUTE(KTONR_AT,$A2,$B2)","v":"10080090000"},{"$f":"SUBSTITUTE(CONCATENATE(RIGHT(IBAN,LEN(IBAN)-4),LEFT(IBAN,4)),$A2,$B2)","v":{"$error":"#VALUE!"}},{"$f":"SUBSTITUTE(BLZ_INT,$A2,$B2)","v":"00061"},{"$f":"SUBSTITUTE(KTONR_INT,$A2,$B2)","v":"00519786457841326"},{"$f":"SUBSTITUTE(Länder_Code,$A2,$B2)","v":"TR"}]
["B",11,{"$f":"SUBSTITUTE(C2,$A3,$B3)","v":"20151"},"10080090000",{"$error":"#VALUE!"},"00061","00519786457841326","TR"]
["C",12,{"$f":"SUBSTITUTE(C3,A4,B4)","v":"20151"},{"$f":"SUBSTITUTE(D3,$A4,$B4)","v":"10080090000"},{"$f":"SUBSTITUTE(E3,$A4,$B4)","v":{"$error":"#VALUE!"}},{"$f":"SUBSTITUTE(F3,$A4,$B4)","v":"00061"},{"$f":"SUBSTITUTE(G3,$A4,$B4)","v":"00519786457841326"},{"$f":"SUBSTITUTE(H3,$A4,$B4)","v":"TR"}]
["D",13,"20151","10080090000",{"$error":"#VALUE!"},"00061","00519786457841326","TR"]
["E",14,"20151","10080090000",{"$error":"#VALUE!"},"00061","00519786457841326","TR"]
["F",15,"20151","10080090000",{"$error":"#VALUE!"},"00061","00519786457841326","TR"]
["G",16,"20151","10080090000",{"$error":"#VALUE!"},"00061","00519786457841326","TR"]
["H",17,"20151","10080090000",{"$error":"#VALUE!"},"00061","00519786457841326","TR"]
["I",18,"20151","10080090000",{"$error":"#VALUE!"},"00061","00519786457841326","TR"]
["J",19,"20151","10080090000",{"$error":"#VALUE!"},"00061","00519786457841326","TR"]
["K",20,"20151","10080090000",{"$error":"#VALUE!"},"00061","00519786457841326","TR"]
["L",21,"20151","10080090000",{"$error":"#VALUE!"},"00061","00519786457841326","TR"]
["M",22,"20151","10080090000",{"$error":"#VALUE!"},"00061","00519786457841326","TR"]
["N",23,"20151","10080090000",{"$error":"#VALUE!"},"00061","00519786457841326","TR"]
["O",24,"20151","10080090000",{"$error":"#VALUE!"},"00061","00519786457841326","TR"]
["P",25,"20151","10080090000",{"$error":"#VALUE!"},"00061","00519786457841326","TR"]
["Q",26,"20151","10080090000",{"$error":"#VALUE!"},"00061","00519786457841326","TR"]
["R",27,"20151","10080090000",{"$error":"#VALUE!"},"00061","00519786457841326","T27"]
["S",28,"20151","10080090000",{"$error":"#VALUE!"},"00061","00519786457841326","T27"]
["T",29,"20151","10080090000",{"$error":"#VALUE!"},"00061","00519786457841326","2927"]
["U",30,"20151","10080090000",{"$error":"#VALUE!"},"00061","00519786457841326","2927"]
["V",31,"20151","10080090000",{"$error":"#VALUE!"},"00061","00519786457841326","2927"]
["W",32,"20151","10080090000",{"$error":"#VALUE!"},"00061","00519786457841326","2927"]
["X",33,"20151","10080090000",{"$error":"#VALUE!"},"00061","00519786457841326","2927"]
["Y",34,"20151","10080090000",{"$error":"#VALUE!"},"00061","00519786457841326","2927"]
["Z",35,"20151","10080090000",{"$error":"#VALUE!"},"00061","00519786457841326","2927"]
["a",10,"20151","10080090000",{"$error":"#VALUE!"},"00061","00519786457841326","2927"]
["b",11,"20151","10080090000",{"$error":"#VALUE!"},"00061","00519786457841326","2927"]
["c",12,"20151","10080090000",{"$error":"#VALUE!"},"00061","00519786457841326","2927"]
["d",13,"20151","10080090000",{"$error":"#VALUE!"},"00061","00519786457841326","2927"]
["e",14,"20151","10080090000",{"$error":"#VALUE!"},"00061","00519786457841326","2927"]
["f",15,"20151","10080090000",{"$error":"#VALUE!"},"00061","00519786457841326","2927"]
["g",16,"20151","10080090000",{"$error":"#VALUE!"},"00061","00519786457841326","2927"]
["h",17,"20151","10080090000",{"$error":"#VALUE!"},"00061","00519786457841326","2927"]
["i",18,{"$f":"SUBSTITUTE(C35,A36,B36)","v":"20151"},{"$f":"SUBSTITUTE(D35,$A36,$B36)","v":"10080090000"},{"$f":"SUBSTITUTE(E35,$A36,$B36)","v":{"$error":"#VALUE!"}},{"$f":"SUBSTITUTE(F35,$A36,$B36)","v":"00061"},{"$f":"SUBSTITUTE(G35,$A36,$B36)","v":"00519786457841326"},{"$f":"SUBSTITUTE(H35,$A36,$B36)","v":"2927"}]
["j",19,"20151","10080090000",{"$error":"#VALUE!"},"00061","00519786457841326","2927"]
["k",20,"20151","10080090000",{"$error":"#VALUE!"},"00061","00519786457841326","2927"]
["l",21,"20151","10080090000",{"$error":"#VALUE!"},"00061","00519786457841326","2927"]
["m",22,"20151","10080090000",{"$error":"#VALUE!"},"00061","00519786457841326","2927"]
["n",23,"20151","10080090000",{"$error":"#VALUE!"},"00061","00519786457841326","2927"]
["o",24,"20151","10080090000",{"$error":"#VALUE!"},"00061","00519786457841326","2927"]
["p",25,"20151","10080090000",{"$error":"#VALUE!"},"00061","00519786457841326","2927"]
["q",26,"20151","10080090000",{"$error":"#VALUE!"},"00061","00519786457841326","2927"]
["r",27,"20151","10080090000",{"$error":"#VALUE!"},"00061","00519786457841326","2927"]
["s",28,"20151","10080090000",{"$error":"#VALUE!"},"00061","00519786457841326","2927"]
["t",29,"20151","10080090000",{"$error":"#VALUE!"},"00061","00519786457841326","2927"]
["u",30,"20151","10080090000",{"$error":"#VALUE!"},"00061","00519786457841326","2927"]
["v",31,"20151","10080090000",{"$error":"#VALUE!"},"00061","00519786457841326","2927"]
["w",32,"20151","10080090000",{"$error":"#VALUE!"},"00061","00519786457841326","2927"]
["x",33,"20151","10080090000",{"$error":"#VALUE!"},"00061","00519786457841326","2927"]
["y",34,"20151","10080090000",{"$error":"#VALUE!"},"00061","00519786457841326","2927"]
["z",35,"20151","10080090000",{"$error":"#VALUE!"},"00061","00519786457841326","2927"]
["-",null,"20151","10080090000",{"$error":"#VALUE!"},"00061","00519786457841326","2927"]
["/",null,"20151","10080090000",{"$error":"#VALUE!"},"00061","00519786457841326","2927"]
[".",null,"20151","10080090000",{"$error":"#VALUE!"},"00061","00519786457841326","2927"]
[":",null,"20151","10080090000",{"$error":"#VALUE!"},"00061","00519786457841326","2927"]
["_",null,"20151","10080090000",{"$error":"#VALUE!"},"00061","00519786457841326","2927"]
[" ",null,{"$f":"SUBSTITUTE(C57,A59,B59)","v":"20151"},{"$f":"SUBSTITUTE(D57,$A59,$B59)","v":"10080090000"},{"$f":"SUBSTITUTE(E58,$A59,$B59)","v":{"$error":"#VALUE!"}},{"$f":"SUBSTITUTE(F58,$A59,$B59)","v":"00061"},{"$f":"SUBSTITUTE(G58,$A59,$B59)","v":"00519786457841326"},{"$f":"SUBSTITUTE(H58,$A59,$B59)","v":"2927"}]
["b) Prüfung der IBAN "]
{"$rows_left_out":96}